id,type,measurements,website,wikipedia,tissue,subTypes,amazon,cancerDotGov,cancerDotOrg,englandAndWalesCharityDetails,charityNavigator,guideStar,greatNonProfits,investorRelationsPage,nyse,nasdaq,coursera,facebook,facebook_followers,gab,gab_followers,instagram,instagram_followers,linkedin,linkedin_followers,pinterest,pinterest_followers,rumble,rumble_followers,telegram,telegram_followers,twitter,twitter_followers,vimeo,vimeo_followers,youTubeChannel,youTubeChannel_followers,gco,github,githubRepo,nciLink,nciImage,pdf,subreddit,subreddit_members,reference,eventsPage,wolframAlpha,youTubeVideo,drugBank,kegg,medlinePlus,pubChem,ein,nciCode,oncoTreeId,parentOncoTreeId,umls,domainName,domainName_registered,relatedConcepts,parentOrganization,company,conceptDescription,nextDate,originCommunity,country,city,standsFor,aka,oldName,tradenames,nciDesignation,hostSchool,mainType,phoneNumber,journal,conceptAuthor,uscsId,appeared,closed,oncoTreeLevel,usNewsRank,uscsDeathsPerYear,uscsCasesPerYear,uscsMortalityRate,cancerTypes,routesOfAdministration,publicationFrequency,isOpenSource,isPublicDomain,annualDeathsReport,members,uscsTable
Skin Cancer,cancerType,23,,https://en.wikipedia.org/wiki/Skin_cancer,Skin,29,,https://www.cancer.gov/types/skin,https://www.cancer.org/cancer/skin-cancer.html,,,,,,,,,,,,,,,,,,,,,,,,,,,,,https://gco.iarc.fr/today/data/factsheets/cancers/16-Melanoma-of-skin-fact-sheet.pdf,,,,,,,,https://www.aad.org/media/stats-skin-cancer,,https://www.wolframalpha.com/input?i=skin+cancer,https://www.youtube.com/watch?v=YWppfk2Np6A,,,,,,C12470,SKIN,TISSUE,C1123023,,,,,,,,,,,,,,,,,"Skin Cancer, NOS",,,,Melanomas of the Skin,,,1,,8059,88001,9,,,,,,,,sex|age|population|cases|deaths\nF|0|1841226|~|~\nF|1-4|7728847|~|~\nF|5-9|9886447|~|~\nF|10-14|10190891|27|~\nF|15-19|10313575|98|~\nF|20-24|10577124|319|~\nF|25-29|11518714|745|~\nF|30-34|11093732|1372|36\nF|35-39|10861340|1676|53\nF|40-44|10014341|1916|78\nF|45-49|10307804|2474|105\nF|50-54|10387588|3034|133\nF|55-59|11232044|3722|232\nF|60-64|10708826|4432|300\nF|65-69|9252566|4457|301\nF|70-74|7527818|4024|340\nF|75-79|5333117|3025|314\nF|80-84|3636357|2156|309\nF|85+|4225260|2560|576\nM|0|1921001|~|~\nM|1-4|8080265|~|~\nM|5-9|10335306|~|~\nM|10-14|10629162|19|~\nM|15-19|10752848|58|~\nM|20-24|11066850|160|~\nM|25-29|12020738|329|23\nM|30-34|11370500|708|41\nM|35-39|10892543|1016|63\nM|40-44|9906220|1338|101\nM|45-49|10082635|1988|145\nM|50-54|10082296|3061|224\nM|55-59|10639047|4815|404\nM|60-64|9851308|6388|534\nM|65-69|8191801|7580|714\nM|70-74|6499159|8082|708\nM|75-79|4317707|6849|713\nM|80-84|2678743|4929|731\nM|85+|2374207|4644|881
Bladder Cancer,cancerType,22,,https://en.wikipedia.org/wiki/Bladder_cancer,Bladder/Urinary Tract,17,,https://www.cancer.gov/types/bladder,https://www.cancer.org/cancer/bladder-cancer.html,,,,,,,,,,,,,,,,,,,,,,,,,,,,,https://gco.iarc.fr/today/data/factsheets/cancers/30-Bladder-fact-sheet.pdf,,,,,,,,https://www.cancer.net/cancer-types/bladder-cancer/introduction,,,,,,,,,C12414,BLADDER,TISSUE,C0005682,,,,,,,,,,,,title Bladder/Urinary Tract Cancer,,,,,"Bladder/Urinary Tract Cancer, NOS",,,,Urinary Bladder,,,1,,16757,74949,22,,,,,,,,sex|age|population|cases|deaths\nF|0|1841226|~|~\nF|1-4|7728847|~|~\nF|5-9|9886447|~|~\nF|10-14|10190891|~|~\nF|15-19|10313575|~|~\nF|20-24|10577124|~|~\nF|25-29|11518714|30|~\nF|30-34|11093732|53|~\nF|35-39|10861340|94|~\nF|40-44|10014341|161|21\nF|45-49|10307804|302|44\nF|50-54|10387588|620|76\nF|55-59|11232044|1269|180\nF|60-64|10708826|1890|273\nF|65-69|9252566|2510|382\nF|70-74|7527818|2923|556\nF|75-79|5333117|2728|664\nF|80-84|3636357|2335|755\nF|85+|4225260|3043|1770\nM|0|1921001|~|~\nM|1-4|8080265|~|~\nM|5-9|10335306|~|~\nM|10-14|10629162|~|~\nM|15-19|10752848|~|~\nM|20-24|11066850|+|~\nM|25-29|12020738|47|~\nM|30-34|11370500|110|~\nM|35-39|10892543|200|~\nM|40-44|9906220|383|33\nM|45-49|10082635|831|74\nM|50-54|10082296|1690|179\nM|55-59|10639047|3684|440\nM|60-64|9851308|6178|892\nM|65-69|8191801|8784|1209\nM|70-74|6499159|10110|1626\nM|75-79|4317707|10032|1908\nM|80-84|2678743|7426|2004\nM|85+|2374207|7516|3671
Breast Cancer,cancerType,21,,https://en.wikipedia.org/wiki/Breast_cancer,Breast,35,,https://www.cancer.gov/types/breast,https://www.cancer.org/cancer/breast-cancer.html,,,,,,,,,,,,,,,,,,,,,,,,,,,,,https://gco.iarc.fr/today/data/factsheets/cancers/20-Breast-fact-sheet.pdf,,,,,,,,https://www.wolframalpha.com/input?i=breast+cancer,,,,,,,,,C12971,BREAST,TISSUE,C0006141,,,,,,,,,,,,,,,,,"Breast Cancer, NOS",,,,Female Breast,,,1,,42269,264115,16,,,,,,US https://www.cdc.gov/cancer/dcpc/research/update-on-cancer-deaths/index.htm,,sex|age|population|cases|deaths\nF|0|1841226|~|~\nF|1-4|7728847|~|~\nF|5-9|9886447|~|~\nF|10-14|10190891|~|~\nF|15-19|10313575|24|~\nF|20-24|10577124|184|~\nF|25-29|11518714|1192|90\nF|30-34|11093732|3305|341\nF|35-39|10861340|6964|759\nF|40-44|10014341|13064|1152\nF|45-49|10307804|20518|1835\nF|50-54|10387588|24768|2762\nF|55-59|11232044|30422|3978\nF|60-64|10708826|36064|4898\nF|65-69|9252566|38975|5123\nF|70-74|7527818|35472|5300\nF|75-79|5333117|24628|4553\nF|80-84|3636357|15175|4142\nF|85+|4225260|13360|7336
Lung Cancer,cancerType,21,,https://en.wikipedia.org/wiki/Lung_cancer,Lung,29,,https://www.cancer.gov/types/lung,https://www.cancer.org/cancer/lung-cancer.html,,,,,,,,,,,,,,,,,,,,,,,,,,,,,https://gco.iarc.fr/today/data/factsheets/cancers/15-Lung-fact-sheet.pdf,,,,,,,,https://www.wolframalpha.com/input?i=lung+cancer,,,,,,,,,C12468,LUNG,TISSUE,C0024109,,,,,,,,,,,,,,,,,"Lung Cancer, NOS",,,,Lung and Bronchus,,,1,,139558,221020,63,,,,,,US https://www.cdc.gov/cancer/dcpc/research/update-on-cancer-deaths/index.htm,,sex|age|population|cases|deaths\nF|0|1841226|~|~\nF|1-4|7728847|~|~\nF|5-9|9886447|~|~\nF|10-14|10190891|~|~\nF|15-19|10313575|+|~\nF|20-24|10577124|37|~\nF|25-29|11518714|66|~\nF|30-34|11093732|125|32\nF|35-39|10861340|289|106\nF|40-44|10014341|638|237\nF|45-49|10307804|1643|753\nF|50-54|10387588|4095|1920\nF|55-59|11232044|9917|4731\nF|60-64|10708826|15034|7530\nF|65-69|9252566|17743|8964\nF|70-74|7527818|20318|11042\nF|75-79|5333117|17681|10857\nF|80-84|3636357|11868|8717\nF|85+|4225260|9595|9826\nM|0|1921001|~|~\nM|1-4|8080265|~|~\nM|5-9|10335306|~|~\nM|10-14|10629162|~|~\nM|15-19|10752848|~|~\nM|20-24|11066850|33|~\nM|25-29|12020738|50|16\nM|30-34|11370500|138|44\nM|35-39|10892543|292|115\nM|40-44|9906220|586|311\nM|45-49|10082635|1476|819\nM|50-54|10082296|3593|2081\nM|55-59|10639047|9601|5627\nM|60-64|9851308|15944|9603\nM|65-69|8191801|19929|11898\nM|70-74|6499159|21589|13515\nM|75-79|4317707|18218|12576\nM|80-84|2678743|11773|9497\nM|85+|2374207|8749|8741
Ovarian Cancer,cancerType,21,,https://en.wikipedia.org/wiki/Ovarian_cancer,Ovary/Fallopian Tube,40,,,https://cancer.org/cancer/ovarian-cancer.html,,,,,,,,,,,,,,,,,,,,,,,,,,,,,https://gco.iarc.fr/today/data/factsheets/cancers/25-Ovary-fact-sheet.pdf,,,,,,,,https://seer.cancer.gov/statfacts/html/ovary.html,,,,,,,,,C12404,OVARY,TISSUE,C0029939,,,,,,,,,,,,,,,,,"Ovarian/Fallopian Tube Cancer, NOS",,,,Ovary,,,1,,13426,19561,69,,,,,,,,sex|age|population|cases|deaths\nF|0|1841226|~|~\nF|1-4|7728847|~|~\nF|5-9|9886447|32|~\nF|10-14|10190891|66|~\nF|15-19|10313575|122|~\nF|20-24|10577124|148|~\nF|25-29|11518714|280|33\nF|30-34|11093732|399|55\nF|35-39|10861340|503|95\nF|40-44|10014341|782|202\nF|45-49|10307804|1199|377\nF|50-54|10387588|1646|686\nF|55-59|11232044|2201|1183\nF|60-64|10708826|2637|1679\nF|65-69|9252566|2461|1930\nF|70-74|7527818|2411|2015\nF|75-79|5333117|2014|1858\nF|80-84|3636357|1349|1531\nF|85+|4225260|1311|1782
Prostate Cancer,cancerType,20,,https://en.wikipedia.org/wiki/Prostate_cancer,Prostate,4,,https://www.cancer.gov/types/prostate,https://www.cancer.org/cancer/prostate-cancer.html,,,,,,,,,,,,,,,,,,,,,,,,,,,,,https://gco.iarc.fr/today/data/factsheets/cancers/27-Prostate-fact-sheet.pdf,,,,,,,,https://www.wolframalpha.com/input?i=prostate+cancer,,,,,,,,,C12410,PROSTATE,TISSUE,C0033572,,,,,,,,,,,,,,,,,"Prostate Cancer, NOS",,,,,,,1,,31628,224703,14,,,,,,US https://www.cdc.gov/cancer/dcpc/research/update-on-cancer-deaths/index.htm,,sex|age|population|cases|deaths\nM|0|1921001|~|~\nM|1-4|8080265|~|~\nM|5-9|10335306|~|~\nM|10-14|10629162|~|~\nM|15-19|10752848|~|~\nM|20-24|11066850|~|~\nM|25-29|12020738|~|~\nM|30-34|11370500|~|~\nM|35-39|10892543|60|~\nM|40-44|9906220|576|21\nM|45-49|10082635|2942|76\nM|50-54|10082296|11014|309\nM|55-59|10639047|26419|915\nM|60-64|9851308|41923|2007\nM|65-69|8191801|53316|3188\nM|70-74|6499159|42827|4402\nM|75-79|4317707|25759|5054\nM|80-84|2678743|11854|5433\nM|85+|2374207|8013|10223
Colon Cancer,cancerType,19,,https://en.wikipedia.org/wiki/Colorectal_cancer,Bowel,24,,,,,,,,,,,,,,,,,,,,,,,,,,,,,,,,https://gco.iarc.fr/today/data/factsheets/cancers/8-Colon-fact-sheet.pdf,,,,,,,,,,,,,,,,,C12736,BOWEL,TISSUE,C0021853,,,,,,,,,,,,Bowel Cancer,,,,,"Bowel Cancer, NOS",,,,Colon and Rectum,,,1,,51874,142438,36,,,,,,,,sex|age|population|cases|deaths\nF|0|1841226|~|~\nF|1-4|7728847|~|~\nF|5-9|9886447|~|~\nF|10-14|10190891|56|~\nF|15-19|10313575|156|~\nF|20-24|10577124|219|16\nF|25-29|11518714|376|49\nF|30-34|11093732|742|82\nF|35-39|10861340|1235|232\nF|40-44|10014341|1916|386\nF|45-49|10307804|3377|763\nF|50-54|10387588|5646|1188\nF|55-59|11232044|6122|1751\nF|60-64|10708826|7256|2245\nF|65-69|9252566|8362|2538\nF|70-74|7527818|8433|2818\nF|75-79|5333117|7449|2877\nF|80-84|3636357|6773|3022\nF|85+|4225260|8752|6254\nM|0|1921001|~|~\nM|1-4|8080265|~|~\nM|5-9|10335306|~|~\nM|10-14|10629162|75|~\nM|15-19|10752848|129|~\nM|20-24|11066850|203|~\nM|25-29|12020738|376|52\nM|30-34|11370500|723|134\nM|35-39|10892543|1287|283\nM|40-44|9906220|2184|495\nM|45-49|10082635|3987|1081\nM|50-54|10082296|7400|1711\nM|55-59|10639047|8598|2606\nM|60-64|9851308|10173|3476\nM|65-69|8191801|10928|3702\nM|70-74|6499159|9764|3666\nM|75-79|4317707|7976|3395\nM|80-84|2678743|6087|2966\nM|85+|2374207|5678|4086
Pancreatic Cancer,cancerType,19,,https://en.wikipedia.org/wiki/Pancreatic_cancer,Pancreas,12,,https://www.cancer.gov/types/pancreatic,,,,,,,,,,,,,,,,,,,,,,,,,,,,,,https://gco.iarc.fr/today/data/factsheets/cancers/13-Pancreas-fact-sheet.pdf,,,,,,,,https://www.wolframalpha.com/input?i=pancreatic+cancer,,,,,,,,,C12393,PANCREAS,TISSUE,C0030274,,,,,,,,,,,,,,,,,"Pancreatic Cancer, NOS",,,,,,,1,,45868,53957,85,,,,,,US https://www.cdc.gov/cancer/dcpc/research/update-on-cancer-deaths/index.htm,,sex|age|population|cases|deaths\nF|0|1841226|~|~\nF|1-4|7728847|~|~\nF|5-9|9886447|~|~\nF|10-14|10190891|+|~\nF|15-19|10313575|+|~\nF|20-24|10577124|+|~\nF|25-29|11518714|62|~\nF|30-34|11093732|84|19\nF|35-39|10861340|121|50\nF|40-44|10014341|273|137\nF|45-49|10307804|577|325\nF|50-54|10387588|998|676\nF|55-59|11232044|2002|1475\nF|60-64|10708826|3058|2373\nF|65-69|9252566|3799|3004\nF|70-74|7527818|4145|3450\nF|75-79|5333117|3891|3459\nF|80-84|3636357|3107|3010\nF|85+|4225260|3819|4172\nM|0|1921001|~|~\nM|1-4|8080265|~|~\nM|5-9|10335306|~|~\nM|10-14|10629162|~|~\nM|15-19|10752848|~|~\nM|20-24|11066850|~|~\nM|25-29|12020738|34|~\nM|30-34|11370500|78|25\nM|35-39|10892543|182|94\nM|40-44|9906220|311|198\nM|45-49|10082635|788|465\nM|50-54|10082296|1458|982\nM|55-59|10639047|2622|2053\nM|60-64|9851308|3890|3146\nM|65-69|8191801|4793|3888\nM|70-74|6499159|4842|4081\nM|75-79|4317707|3975|3514\nM|80-84|2678743|2745|2701\nM|85+|2374207|2303|2571
Kidney Cancer,cancerType,18,,https://en.wikipedia.org/wiki/Kidney_cancer,Kidney,21,,https://www.cancer.gov/types/kidney,,,,,,,,,,,,,,,,,,,,,,,,,,,,,,https://gco.iarc.fr/today/data/factsheets/cancers/29-Kidney-fact-sheet.pdf,,,,,,,,,,,,,,,,,C12415,KIDNEY,TISSUE,C0022646,,,,,,,,,,,,,,,,,"Kidney Cancer, NOS",,,,Kidney and Renal Pelvis,,,1,,13940,68020,20,,,,,,,,sex|age|population|cases|deaths\nF|0|1841226|20|~\nF|1-4|7728847|158|~\nF|5-9|9886447|52|~\nF|10-14|10190891|+|~\nF|15-19|10313575|23|~\nF|20-24|10577124|61|~\nF|25-29|11518714|149|~\nF|30-34|11093732|303|~\nF|35-39|10861340|621|17\nF|40-44|10014341|907|36\nF|45-49|10307804|1292|72\nF|50-54|10387588|1786|173\nF|55-59|11232044|2622|293\nF|60-64|10708826|3377|454\nF|65-69|9252566|3751|575\nF|70-74|7527818|3502|687\nF|75-79|5333117|2670|661\nF|80-84|3636357|1756|649\nF|85+|4225260|1604|1129\nM|0|1921001|37|~\nM|1-4|8080265|135|~\nM|5-9|10335306|45|~\nM|10-14|10629162|~|~\nM|15-19|10752848|27|~\nM|20-24|11066850|92|~\nM|25-29|12020738|182|23\nM|30-34|11370500|393|20\nM|35-39|10892543|863|50\nM|40-44|9906220|1499|93\nM|45-49|10082635|2527|229\nM|50-54|10082296|3570|405\nM|55-59|10639047|5378|787\nM|60-64|9851308|6441|1111\nM|65-69|8191801|7066|1381\nM|70-74|6499159|6275|1425\nM|75-79|4317707|4403|1313\nM|80-84|2678743|2641|1056\nM|85+|2374207|1792|1301
Liver Cancer,cancerType,18,,https://en.wikipedia.org/wiki/Liver_cancer,Liver,9,,,,,,,,,,,,,,,,,,,,,,,,,,,,,,,,https://gco.iarc.fr/today/data/factsheets/cancers/11-Liver-fact-sheet.pdf,,,,,,,,,,,,,,,,,C12392,LIVER,TISSUE,C0023884,,,,,,,,,,,,,,,,,"Liver Cancer, NOS",,,,Liver and Intrahepatic Bile Duct,,,1,,27882,35443,79,,,,,,US https://www.cdc.gov/cancer/dcpc/research/update-on-cancer-deaths/index.htm,,sex|age|population|cases|deaths\nF|0|1841226|34|~\nF|1-4|7728847|38|~\nF|5-9|9886447|~|~\nF|10-14|10190891|~|~\nF|15-19|10313575|+|~\nF|20-24|10577124|+|~\nF|25-29|11518714|28|~\nF|30-34|11093732|44|23\nF|35-39|10861340|87|41\nF|40-44|10014341|118|78\nF|45-49|10307804|216|148\nF|50-54|10387588|445|298\nF|55-59|11232044|956|653\nF|60-64|10708826|1551|1135\nF|65-69|9252566|1897|1355\nF|70-74|7527818|1701|1427\nF|75-79|5333117|1395|1389\nF|80-84|3636357|1052|1119\nF|85+|4225260|1090|1566\nM|0|1921001|25|~\nM|1-4|8080265|65|~\nM|5-9|10335306|~|~\nM|10-14|10629162|~|~\nM|15-19|10752848|~|~\nM|20-24|11066850|~|~\nM|25-29|12020738|47|22\nM|30-34|11370500|92|54\nM|35-39|10892543|138|70\nM|40-44|9906220|203|130\nM|45-49|10082635|480|310\nM|50-54|10082296|1257|732\nM|55-59|10639047|3200|1920\nM|60-64|9851308|4962|3444\nM|65-69|8191801|5328|3781\nM|70-74|6499159|3663|3007\nM|75-79|4317707|2508|2133\nM|80-84|2678743|1606|1562\nM|85+|2374207|1217|1485
The University of Texas MD Anderson Cancer Center,nciCancerCenter,18,https://www.mdanderson.org/,https://en.wikipedia.org/wiki/MD_Anderson_Cancer_Center,,,,,,,,,,,,,,https://facebook.com/mdanderson,,,,https://instagram.com/mdandersoncancercenter,,https://linkedin.com/company/mdandersoncancercenter,,https://pinterest.com/mdandersoncc,,,,,,https://twitter.com/mdandersonnews,131500,,,https://youtube.com/user/mdandersonorg,,,,,https://www.cancer.gov/research/infrastructure/cancer-centers/find/mdanderson,https://www.cancer.gov/sites/g/files/xnrzdm211/files/styles/cgov_social_media/public/cgov_image/media_image/900/300/files/mdanderson-article.jpg,,,,,,,,,,,,,,,,,,,,,,,,,United States,"Houston, Texas",,,,,Comprehensive Cancer Center,University of Texas,,1-877-632-6789,,,,,,,1,,,,,,,,,,,
Cervical Cancer,cancerType,17,,https://en.wikipedia.org/wiki/Cervical_cancer,Cervix,23,,,https://www.cancer.org/cancer/cervical-cancer.html,,,,,,,,,,,,,,,,,,,,,,,,,,,,,,,,,,,,,,,,,,,,,,C12311,CERVIX,TISSUE,C0007874,,,,,,,,,,,,,,,,,"Cervical Cancer, NOS",,,,Cervix,,,1,,4144,12790,32,,,,,,,,sex|age|population|cases|deaths\nF|0|1841226|~|~\nF|1-4|7728847|~|~\nF|5-9|9886447|~|~\nF|10-14|10190891|~|~\nF|15-19|10313575|~|~\nF|20-24|10577124|49|~\nF|25-29|11518714|472|52\nF|30-34|11093732|1292|131\nF|35-39|10861340|1500|233\nF|40-44|10014341|1510|317\nF|45-49|10307804|1474|400\nF|50-54|10387588|1336|446\nF|55-59|11232044|1297|507\nF|60-64|10708826|1236|511\nF|65-69|9252566|886|450\nF|70-74|7527818|663|378\nF|75-79|5333117|476|281\nF|80-84|3636357|286|187\nF|85+|4225260|313|251
Esophagus/Stomach Cancer,cancerType,17,,https://en.wikipedia.org/wiki/Esophageal_cancer,Esophagus/Stomach,23,,,,,,,,,,,,,,,,,,,,,,,,,,,,,,,,https://gco.iarc.fr/today/data/factsheets/cancers/6-Oesophagus-fact-sheet.pdf,,,,,,,,,,,,,,,,,C12391,STOMACH,TISSUE,C0038351,,,,,,,,,,,,,,,,,"Esophageal/Stomach Cancer, NOS",,,,Esophagus,,,1,,15918,18872,84,,,,,,,,sex|age|population|cases|deaths\nF|0|1841226|~|~\nF|1-4|7728847|~|~\nF|5-9|9886447|~|~\nF|10-14|10190891|~|~\nF|15-19|10313575|~|~\nF|20-24|10577124|~|~\nF|25-29|11518714|~|~\nF|30-34|11093732|~|~\nF|35-39|10861340|20|~\nF|40-44|10014341|41|24\nF|45-49|10307804|100|50\nF|50-54|10387588|201|143\nF|55-59|11232044|420|250\nF|60-64|10708826|577|422\nF|65-69|9252566|624|426\nF|70-74|7527818|619|440\nF|75-79|5333117|516|419\nF|80-84|3636357|396|416\nF|85+|4225260|498|525\nM|0|1921001|~|~\nM|1-4|8080265|~|~\nM|5-9|10335306|~|~\nM|10-14|10629162|~|~\nM|15-19|10752848|~|~\nM|20-24|11066850|~|~\nM|25-29|12020738|~|~\nM|30-34|11370500|+|25\nM|35-39|10892543|87|57\nM|40-44|9906220|183|139\nM|45-49|10082635|399|276\nM|50-54|10082296|850|653\nM|55-59|10639047|1579|1227\nM|60-64|9851308|2443|1909\nM|65-69|8191801|2760|2138\nM|70-74|6499159|2580|2188\nM|75-79|4317707|1846|1750\nM|80-84|2678743|1186|1267\nM|85+|2374207|947|1174
Jonsson Comprehensive Cancer Center,nciCancerCenter,17,https://cancer.ucla.edu/,https://en.wikipedia.org/wiki/Jonsson_Comprehensive_Cancer_Center,,,,,,,,,,,,,,https://www.facebook.com/UCLAJonssonComprehensiveCancerCenter/,14000,,,https://www.instagram.com/uclajonssoncancercenter/,2232,https://www.linkedin.com/company/jonsson-cancer-center/,868,,,,,,,https://twitter.com/uclajccc,9993,,,https://www.youtube.com/UCLAJCCC,1890,,,,https://www.cancer.gov/research/infrastructure/cancer-centers/find/uclajonsson,https://www.cancer.gov/sites/g/files/xnrzdm211/files/styles/cgov_social_media/public/cgov_image/media_image/900/300/files/uclajonsson-article.jpg,,,,,,,,,,,,,,,,,,,,,,,,,United States,"Los Angeles, California",,,,,Comprehensive Cancer Center,University of California at Los Angeles,,1-310-825-5268,,,,,,,5,,,,,,,,,,,
Thyroid Cancer,cancerType,17,,https://en.wikipedia.org/wiki/Thyroid_cancer,Thyroid,9,,,,,,,,,,,,,,,,,,,,,,,,,,,,,,,,https://gco.iarc.fr/today/data/factsheets/cancers/32-Thyroid-fact-sheet.pdf,,,,,,,,,,,,,,,,,C12400,THYROID,TISSUE,C0040132,,,,,,,,,,,,,,,,,"Thyroid Cancer, NOS",,,,Thyroid,,,1,,2000,45272,4,,,,,,,,sex|age|population|cases|deaths\nF|0|1841226|~|~\nF|1-4|7728847|~|~\nF|5-9|9886447|+|~\nF|10-14|10190891|152|~\nF|15-19|10313575|613|~\nF|20-24|10577124|1152|~\nF|25-29|11518714|1917|~\nF|30-34|11093732|2689|~\nF|35-39|10861340|3142|~\nF|40-44|10014341|3245|~\nF|45-49|10307804|3381|16\nF|50-54|10387588|3358|32\nF|55-59|11232044|3418|60\nF|60-64|10708826|3059|91\nF|65-69|9252566|2682|134\nF|70-74|7527818|2069|150\nF|75-79|5333117|1168|161\nF|80-84|3636357|554|159\nF|85+|4225260|382|261\nM|0|1921001|~|~\nM|1-4|8080265|~|~\nM|5-9|10335306|~|~\nM|10-14|10629162|45|~\nM|15-19|10752848|118|~\nM|20-24|11066850|238|~\nM|25-29|12020738|471|~\nM|30-34|11370500|549|~\nM|35-39|10892543|791|~\nM|40-44|9906220|946|~\nM|45-49|10082635|1068|27\nM|50-54|10082296|1258|37\nM|55-59|10639047|1345|69\nM|60-64|9851308|1504|102\nM|65-69|8191801|1447|128\nM|70-74|6499159|1151|156\nM|75-79|4317707|754|160\nM|80-84|2678743|368|132\nM|85+|2374207|238|125
Uterine Cancer,cancerType,17,,https://en.wikipedia.org/wiki/Uterine_cancer,Uterus,36,,https://www.cancer.gov/types/uterine,,,,,,,,,,,,,,,,,,,,,,,,,,,,,,,,,,,,,,,,,,,,,,,C12405,UTERUS,TISSUE,C0042149,,,,,,,,,,,,,,,,,"Uterine Cancer, NOS",,,,"Corpus and Uterus, NOS",,,1,,11539,59447,19,,,,,,,,sex|age|population|cases|deaths\nF|0|1841226|~|~\nF|1-4|7728847|~|~\nF|5-9|9886447|~|~\nF|10-14|10190891|~|~\nF|15-19|10313575|~|~\nF|20-24|10577124|60|~\nF|25-29|11518714|264|~\nF|30-34|11093732|652|35\nF|35-39|10861340|1172|83\nF|40-44|10014341|1738|116\nF|45-49|10307804|2892|253\nF|50-54|10387588|4927|467\nF|55-59|11232044|8525|899\nF|60-64|10708826|10632|1577\nF|65-69|9252566|10737|2005\nF|70-74|7527818|8292|2006\nF|75-79|5333117|4888|1539\nF|80-84|3636357|2649|1149\nF|85+|4225260|2019|1410
Alvin J. Siteman Cancer Center,nciCancerCenter,16,https://siteman.wustl.edu/,https://en.wikipedia.org/wiki/Alvin_J._Siteman_Cancer_Center,,,,,,,,,,,,,,https://www.facebook.com/SitemanCancerCenter,168000,,,,,,,https://www.pinterest.com/sitemancenter/,1100,,,,,https://twitter.com/SitemanCenter,35100,,,https://www.youtube.com/user/SitemanCancerCenter,2390,,,,https://www.cancer.gov/research/infrastructure/cancer-centers/find/washingtonsiteman,https://www.cancer.gov/sites/g/files/xnrzdm211/files/styles/cgov_social_media/public/cgov_image/media_image/2019-10/Siteman_Parkview%20Tower_exterior%20shot_night%5B1%5D%5B1%5D.jpg,,,,,,,,,,,,,,,,,,,,,,,,,United States,"St. Louis, Missouri",,,,,Comprehensive Cancer Center,Washington University School of Medicine and Barnes-Jewish Hospital,,1-800-600-3606,,,,,,,10,,,,,,,,,,,
Basal Cell Carcinoma,cancerType,16,,https://en.wikipedia.org/wiki/Basal-cell_carcinoma,Skin,0,,,https://www.cancer.org/cancer/basal-and-squamous-cell-skin-cancer.html,,,,,,,,,,,,,,,,,,,,,,,,,,,,,,,,,,,,,https://www.aad.org/public/diseases/skin-cancer/types/common/bcc,,,,,,,,,C2921,BCC,SKIN,C0007117,,,,,,,,,,,,,,,,,"Skin Cancer, Non-Melanoma",,,,,,,2,,,,,,,,,,,,
Brain Cancer,cancerType,16,,,CNS/Brain,104,,,,,,,,,,,,,,,,,,,,,,,,,,,,,,,,https://gco.iarc.fr/today/data/factsheets/cancers/31-Brain-central-nervous-system-fact-sheet.pdf,,,,,,,,,,,,,,,,,C12438,BRAIN,TISSUE,C3714787,,,,,,,,,,,,,,,,,"CNS/Brain Cancer, NOS",,,,Brain and Other Nervous System,,,1,,17215,22538,76,,,,,,,,sex|age|population|cases|deaths\nF|0|1841226|56|~\nF|1-4|7728847|266|28\nF|5-9|9886447|299|77\nF|10-14|10190891|256|71\nF|15-19|10313575|210|55\nF|20-24|10577124|188|44\nF|25-29|11518714|251|70\nF|30-34|11093732|329|87\nF|35-39|10861340|362|153\nF|40-44|10014341|360|168\nF|45-49|10307804|460|248\nF|50-54|10387588|597|419\nF|55-59|11232044|863|698\nF|60-64|10708826|1001|924\nF|65-69|9252566|1145|1075\nF|70-74|7527818|1098|1085\nF|75-79|5333117|850|882\nF|80-84|3636357|582|625\nF|85+|4225260|590|713\nM|0|1921001|56|~\nM|1-4|8080265|330|42\nM|5-9|10335306|343|76\nM|10-14|10629162|289|70\nM|15-19|10752848|240|77\nM|20-24|11066850|280|56\nM|25-29|12020738|365|98\nM|30-34|11370500|448|161\nM|35-39|10892543|468|220\nM|40-44|9906220|526|253\nM|45-49|10082635|635|436\nM|50-54|10082296|872|640\nM|55-59|10639047|1292|1063\nM|60-64|9851308|1447|1313\nM|65-69|8191801|1538|1416\nM|70-74|6499159|1372|1425\nM|75-79|4317707|1060|1058\nM|80-84|2678743|690|721\nM|85+|2374207|524|668
Hodgkin Lymphoma,cancerType,16,,,Lymphoid,6,,,,,,,,,,,,,,,,,,,,,,,,,,,,,,,,https://gco.iarc.fr/today/data/factsheets/cancers/33-Hodgkin-lymphoma-fact-sheet.pdf,,,,,,,,,,,,,,,,,C9357,HL,LNM,C0019829,,,,,,,,,,,,,,,,,Hodgkin Lymphoma,,,,Hodgkin Lymphoma,,,3,,873,8515,10,,,,,,,,sex|age|population|cases|deaths\nF|0|1841226|~|~\nF|1-4|7728847|~|~\nF|5-9|9886447|24|~\nF|10-14|10190891|103|~\nF|15-19|10313575|324|~\nF|20-24|10577124|442|~\nF|25-29|11518714|424|~\nF|30-34|11093732|371|~\nF|35-39|10861340|315|~\nF|40-44|10014341|216|~\nF|45-49|10307804|214|~\nF|50-54|10387588|187|17\nF|55-59|11232044|193|25\nF|60-64|10708826|198|26\nF|65-69|9252566|223|40\nF|70-74|7527818|170|42\nF|75-79|5333117|165|51\nF|80-84|3636357|119|57\nF|85+|4225260|98|79\nM|0|1921001|~|~\nM|1-4|8080265|~|~\nM|5-9|10335306|46|~\nM|10-14|10629162|149|~\nM|15-19|10752848|345|~\nM|20-24|11066850|471|~\nM|25-29|12020738|466|~\nM|30-34|11370500|421|17\nM|35-39|10892543|308|18\nM|40-44|9906220|298|19\nM|45-49|10082635|272|22\nM|50-54|10082296|273|36\nM|55-59|10639047|354|42\nM|60-64|9851308|333|63\nM|65-69|8191801|310|70\nM|70-74|6499159|270|62\nM|75-79|4317707|200|61\nM|80-84|2678743|124|64\nM|85+|2374207|89|62